StackAsk is a community where developers ask questions, share answers and learn from each others real-world experience, so every solved problem helps the next person who runs into it.
com/tvd12/ezyhttp/core/boot/test/BootApp.java
[ERROR] Failed to execute goal org.apache.maven.plugins:maven-surefire-plugin:2.22.2:test (default-test) on project ezyhttp-server-graphql: There are test failures. [ERROR] [ERROR] Please refer to /Users/AnhVu/Work/Ezyfox/references/ezyhttp/ezyhttp-server-graphql/target/surefire-reports for the individual test results. [ERROR] Please refer to dump files (if any exist) [date].dump, [date]-jvmRun[N].dump and [date].dumpstream. [ERROR] There was an error in the forked process [ERROR] Suite file /Users/AnhVu/Work/Ezyfox/references/ezyhttp/ezyhttp-server-graphql/src/test/resources/AllTests.tng.xml is not a valid file [ERROR] org.apache.maven.surefire.booter.SurefireBooterForkException: There was an error in the forked process [ERROR] Suite file /Users/AnhVu/Work/Ezyfox/references/ezyhttp/ezyhttp-server-graphql/src/test/resources/AllTests.tng.xml is not a valid file [ERROR] at org.apache.maven.plugin.surefire.booterclient.ForkStarter.fork(ForkStarter.java:656) [ERROR] at org.apache.maven.plugin.surefire.booterclient.ForkStarter.run(ForkStarter.java:282) [ERROR] at org.apache.maven.plugin.surefire.booterclient.ForkStarter.run(ForkStarter.java:245) [ERROR] at org.apache.maven.plugin.surefire.AbstractSurefireMojo.executeProvider(AbstractSurefireMojo.java:1183) [ERROR] at org.apache.maven.plugin.surefire.AbstractSurefireMojo.executeAfterPreconditionsChecked(AbstractSurefireMojo.java:1011) [ERROR] at org.apache.maven.plugin.surefire.AbstractSurefireMojo.execute(AbstractSurefireMojo.java:857) [ERROR] at org.apache.maven.plugin.DefaultBuildPluginManager.executeMojo(DefaultBuildPluginManager.java:134) [ERROR] at org.apache.maven.lifecycle.internal.MojoExecutor.execute(MojoExecutor.java:208) [ERROR] at org.apache.maven.lifecycle.internal.MojoExecutor.execute(MojoExecutor.java:154) [ERROR] at org.apache.maven.lifecycle.internal.MojoExecutor.execute(MojoExecutor.java:146) [ERROR] at org.apache.maven.lifecycle.internal.LifecycleModuleBuilder.buildProject(LifecycleModuleBuilder.java:117) [ERROR] at org.apache.maven.lifecycle.internal.LifecycleModuleBuilder.buildProject(LifecycleModuleBuilder.java:81) [ERROR] at org.apache.maven.lifecycle.internal.builder.singlethreaded.SingleThreadedBuilder.build(SingleThreadedBuilder.java:51) [ERROR] at org.apache.maven.lifecycle.internal.LifecycleStarter.execute(LifecycleStarter.java:128) [ERROR] at org.apache.maven.DefaultMaven.doExecute(DefaultMaven.java:309) [ERROR] at org.apache.maven.DefaultMaven.doExecute(DefaultMaven.java:194) [ERROR] at org.apache.maven.DefaultMaven.execute(DefaultMaven.java:107) [ERROR] at org.apache.maven.cli.MavenCli.execute(MavenCli.java:955) [ERROR] at org.apache.maven.cli.MavenCli.doMain(MavenCli.java:290) [ERROR] at org.apache.maven.cli.MavenCli.main(MavenCli.java:194) [ERROR] at sun.reflect.NativeMethodAccessorImpl.invoke0(Native Method) [ERROR] at sun.reflect.NativeMethodAccessorImpl.invoke(NativeMethodAccessorImpl.java:62) [ERROR] at sun.reflect.DelegatingMethodAccessorImpl.invoke(DelegatingMethodAccessorImpl.java:43) [ERROR] at java.lang.reflect.Method.invoke(Method.java:498) [ERROR] at org.codehaus.plexus.classworlds.launcher.Launcher.launchEnhanced(Launcher.java:289) [ERROR] at org.codehaus.plexus.classworlds.launcher.Launcher.launch(Launcher.java:229) [ERROR] at org.codehaus.plexus.classworlds.launcher.Launcher.mainWithExitCode(Launcher.java:415) [ERROR] at org.codehaus.plexus.classworlds.launcher.Launcher.main(Launcher.java:356) [ERROR] [ERROR] -> [Help 1] [ERROR] [ERROR] To see the full stack trace of the errors, re-run Maven with the -e switch. [ERROR] Re-run Maven using the -X switch to enable full debug logging. [ERROR] [ERROR] For more information about the errors and possible solutions, please read the following articles: [ERROR] [Help 1] http://cwiki.apache.org/confluence/display/MAVEN/MojoExecutionException [ERROR] [ERROR] After correcting the problems, you can resume the build with the command [ERROR] mvn -rf :ezyhttp-server-graphql
ezyhttp-server-graphql/src/test/resources/AllTests.tng.xml
BootApp.java
2.2K Point(s)
1.2K Point(s)
313 Point(s)
178 Point(s)
138 Point(s)
Your account is signed in on the device(s) below. Sign out of at least one of them to continue signing in on this device.
Your account is signed in on the device(s) below. Sign out directly on one of those devices, or wait until the sign-in again time shown below.
If you cant access those devices, please contact the administrator to sign them out for you.
Input your email to receive reset password link, or if you remember your password, you can click